{"text_format":"1","workbook":"xlsx","n_sheets":15,"sheets":["①企業健診について ","②健康診断申込書 ","ID","③注意事項 ","④受診者リスト","ID(当院入力シート)","⑤申込みスケジュール","⑥営業時間","⑦診療日カレンダー","⓼オプション","⑧オプション一覧","取り込み用","契約コース内容","運用について","検査項目セレクト"],"not_rendered":{"charts":0,"images":4,"macros":1,"external_links":2,"defined_names":41,"comments":0,"pivot_tables":0},"unopened":[],"bounds":{"document_bytes":16777216,"sheet_cells":100000,"rows_first":2000,"rows_last":500,"rows_between":2000,"halvings":0,"cell_chars":16384,"cell_head_chars":4096},"cells_cut":0,"cells_raw":0,"read":"whole","date_system":"1900"}

{"sheet":"①企業健診について ","index":0,"n_rows":25,"n_cols":4,"rows_kept":25,"cut":false,"hidden":false,"merged":[[19,2,19,27],[22,1,22,31],[23,1,23,31],[24,1,24,31],[11,1,11,31],[14,2,14,27],[15,2,15,27],[16,2,16,27],[17,2,17,27],[18,2,18,27],[10,1,10,8],[1,1,1,31],[3,1,3,31],[6,3,6,21],[7,3,7,21]]}
[]
[null,"2026年度 企業健診申込について"]
[]
[null,"企業健診の申込みにつきまして、下記の必要書類をご用意の上ご予約いただきますようお願い申し上げます。"]
[]
[null,null,null,"【企業健診申込みに必要な書類】"]
[null,null,null,"　1.健康診断申込書"]
[null,null,null,"　2.　④受診者リスト　"]
[]
[]
[null,"【注意事項】"]
[null,"◎ご予約について\n　３名様以上のご予約は、申込書類をご入力の上、メールにてお申し込みください。\n　２名様までのご予約は個人WEB・お電話にてお申し込み可能です。\n　雇用時健診、深夜業健診についてはこちらの申込書では対応しておりません。\n\n◎請求書発行について\n　・請求書発行は10名様以上のご予約を取り纏めて頂ける企業様のみとさせて頂きます。\n　（9名様以下の企業様及び個人でのお申込みは当日窓口支払いとなります）\n　・同一年度内に複数回お申し込みいただく場合、2回目以降のご予約は、初回にご提出いただいた企業情報\n　　（お支払方法等）を基に対応いたします。\n\n◎企業様健診結果の送付について\n　『労働安全衛生規則』に定められた検査結果の提供となります。\n\n　ご理解ご協力の程よろしくお願い申し上げます。"]
[]
[]
[null,null,"■お申込み方法お問合せ"]
[null,null,"医療法人 福岡桜十字 桜十字福岡病院 <人間ドック・健診センター>"]
[null,null,"TEL : 092-791-1120  　"]
[null,null,"メール : f.web.yoyaku@sakurajyuji.jp  "]
[null,null,"受付時間 平日 8:30～16:30 ／ 第 １・３土曜 8:30～12:00"]
[null,null,"（但し、祝日及び４月第１土曜日は休診日となります。）"]
{"$rows_left_out":6}
{"sheet":"②健康診断申込書 ","index":1,"n_rows":56,"n_cols":27,"rows_kept":56,"cut":false,"hidden":false,"merged":[[21,1,21,4],[21,5,21,13],[21,14,21,17],[27,1,27,6],[28,1,28,26],[21,18,21,26],[22,1,22,4],[22,5,22,26],[23,1,24,4],[23,5,24,13],[23,14,24,17],[23,18,23,19],[23,20,23,26],[24,18,24,26],[26,16,26,26],[8,1,8,26],[1,15,1,18],[1,19,1,21],[3,1,3,26],[7,1,7,26],[6,11,6,15],[6,1,6,10],[4,19,4,25],[5,1,5,25],[9,1,11,4],[9,5,9,7],[9,8,9,26],[10,5,11,26],[12,1,15,4],[12,6,12,7],[12,9,12,11],[12,12,12,26],[13,5,14,26],[16,5,18,8],[16,1,18,4],[20,1,20,4],[20,5,20,13],[20,14,20,17],[19,1,19,4],[19,5,19,26],[16,10,17,26],[18,9,18,17],[29,7,29,13],[29,14,29,26],[25,16,25,26],[29,1,29,6],[33,14,33,26],[30,1,30,6],[30,7,30,13],[30,14,30,26],[31,1,31,6],[31,7,31,13],[31,14,31,26],[32,1,32,6],[32,7,32,13],[32,14,32,26],[33,1,33,6],[33,7,33,13],[34,1,34,6],[34,7,34,13],[34,14,34,26],[39,1,39,6],[39,7,39,26],[36,14,36,26],[38,1,38,6],[38,7,38,26],[37,1,37,6],[37,7,37,26],[35,14,35,26],[35,7,35,13],[35,1,35,6],[55,2,55,17],[40,1,40,7],[41,1,42,26],[52,2,52,15],[53,2,53,17],[54,2,54,17],[50,2,50,8],[47,3,47,5]]}
[]
[null,null,null,null,null,null,null,null,null,null,null,null,null,null,null,"お 申 込 日",null,null,null,null,null,null,"年",null,"月",null,"日"]
[]
[null,"２０２６年 度 健 康 診 断 団 体申 込 書 （３名様以上）"]
[null,null,null,null,null,null,null,null,null,null,null,null,null,null,null,null,null,null,null,"必須：必ず入力してください"]
[null,"②.健康診断申込書（本用紙）④.受診者リストと共にメールにてお申込み下さい。\n"]
[null,"※２名様までは個人WEBをご利用ください。⇒",null,null,null,null,null,null,null,null,null,"個人WEB申し込み"]
[null,"◎事業所様情報"]
[null,"　下記事業所様住所へ送付物（事前ご案内書類・健診結果・対象事業所様は請求書）の手配をいたします。\n　"]
[null,"事  業  所  名",null,null,null,"フ リ ガ ナ"]
[]
[]
[null,"事業所所在地\n(事前書類の発送先)",null,null,null,"〒",null,null,"-"]
[]
[]
[]
[null,"請求書・企業控え発送先\n※1※2",null,null,null,"選択してください",null,null,null,"〒"]
[]
[null,null,null,null,null,null,null,null,null,null,null,null,null,null,null,null,null,null,null,"※健診結果・請求書は同一住所となります"]
[null,"保険者名称"]
{"$rows_left_out":37}
{"sheet":"ID","index":2,"n_rows":1,"n_cols":11,"rows_kept":1,"cut":false,"hidden":true,"merged":[]}
["ID","カナ氏名","氏名","性別","生年月日","団体1・団体番号","本人家族区分","任継区分","被保険者証等記号","被保険者証等番号","保険者番号"]

{"sheet":"③注意事項 ","index":3,"n_rows":32,"n_cols":13,"rows_kept":32,"cut":false,"hidden":false,"merged":[[3,1,3,15],[5,2,5,14],[6,3,6,13],[8,3,8,7],[8,9,8,13],[9,4,9,5],[9,6,9,7],[9,10,9,11],[9,12,9,13],[10,4,10,5],[10,6,10,7],[10,10,10,11],[10,12,10,13],[11,4,11,5],[11,6,11,7],[11,10,11,11],[11,12,11,13],[12,4,12,5],[12,6,12,7],[12,10,12,11],[12,12,12,13],[13,4,13,5],[13,6,13,7],[13,10,13,11],[13,12,13,13],[14,4,14,5],[14,6,14,7],[14,10,14,11],[14,12,14,13],[15,4,15,5],[15,6,15,7],[15,10,15,11],[15,12,15,13],[16,4,16,5],[16,6,16,7],[16,10,16,11],[16,12,16,13],[17,4,17,5],[17,6,17,7],[17,10,17,11],[17,12,17,13],[18,4,18,5],[18,6,18,7],[18,10,18,11],[18,12,18,13],[19,4,19,5],[19,6,19,7],[19,10,19,11],[19,12,19,13],[20,4,20,5],[20,6,20,7],[20,10,20,11],[20,12,20,13],[25,2,25,14],[27,2,27,14],[29,2,29,14],[31,2,31,14],[21,4,21,5],[21,6,21,7],[21,10,21,11],[21,12,21,13],[24,2,24,14]]}
["あ"]
[]
[]
[null,"ご予約受付時に不備が多い項目"]
[]
[null,null,"◇　【胃部検査項目】欄の記入に関して\n　　 補助内での検査をご希望の場合は「胃透視検査（バリウム）」をご選択/ご記入ください。\n　　 「胃カメラ（胃部内視鏡）」をご希望の場合、差額は実費負担となりますのでご了承ください。\n　　 \n ※ 胃カメラ選択時は、①鎮静剤なし：経口、経鼻　②鎮静剤あり：経口からお選びください。\n　　 ご希望の内容によってご予約可能なお時間が異なりますので下記表をご参照下さい。\n　　 なお、「鎮静剤なし」の時間帯でご予約いただいた方につきましては、\n　　 健診日当日に「鎮静剤あり」への変更はできませんので予めご了承ください。"]
[null,null,null,"● 鎮静剤あり　　　　　× 鎮静剤なし　　　　　△ 選択可能"]
[]
[null,null,null,"天神",null,null,null,null,null,"博多"]
[null,null,null,null,"平日",null,"土曜日",null,null,null,"平日",null,"土曜日"]
[null,null,null,"07:45:00","△",null,null,null,null,"07:45:00"]
[null,null,null,"08:00:00","△",null,"△",null,null,"08:00:00","●",null,"●"]
[null,null,null,"08:15:00","△",null,"△",null,null,"08:15:00","●",null,"●"]
[null,null,null,"08:30:00","△",null,"△",null,null,"08:30:00","×"]
[null,null,null,"08:45:00","×",null,"△",null,null,"08:45:00","×"]
[null,null,null,"09:00:00","●",null,"×",null,null,"09:00:00","●",null,"●"]
[null,null,null,"09:15:00","●",null,"×",null,null,"09:15:00","●",null,"●"]
[null,null,null,"09:30:00","×",null,null,null,null,"09:30:00","×"]
[null,null,null,"09:45:00",null,null,null,null,null,"09:45:00","×"]
[null,null,null,"10:00:00",null,null,null,null,null,"10:00:00","●",null,"●"]
{"$rows_left_out":13}
{"sheet":"④受診者リスト","index":4,"n_rows":1000,"n_cols":34,"rows_kept":1000,"cut":false,"hidden":false,"merged":[[0,1,0,2],[3,2,3,3],[10,2,11,2],[10,12,10,14],[9,11,9,14],[10,7,11,7],[10,10,11,10],[10,11,11,11],[9,17,9,18],[9,19,9,20],[10,9,11,9],[6,3,6,4],[10,24,11,24],[10,3,11,6],[8,22,8,25],[10,15,11,16],[10,17,11,18],[10,19,11,20],[9,15,9,16]]}
["出力日時",{"$f":"NOW()","v":"2026-02-10T15:51:09.850"}]
["2026年度　健康診断予約表（団体用・３名以上）",null,null,null,null,"※協会けんぽの方はこちら"]
["団体番号",null,"（当院入力箇所）"]
[]
[null,"ご入力の前に"]
[null,"記号・番号・保険者番号、生年月日、受診する健診項目、健診予定日等の情報をご準備ください。"]
[null,"２名様までは個人WEBをご利用ください⇒",null,"個人WEB予約",null,null,null,null,"年齢起算"]
[null,null,null,null,null,null,null,null,"2027-04-01"]
["自動","自動",null,null,null,null,null,null,"自動",null,null,null,null,null,null,null,null,null,null,null,null,null,"※当院入力欄"]
["NO.","ID","施設","番号","保険証氏名\n氏名間全角スペース","フリガナ（全角）\n氏名間全角スペース","性別","生年月日","年齢","健診コース\n※任意のコースを選択されると負担金額が変わりますのでご注意ください。","胃部検査","追加オプション　　　　　　　　　　　　　　　　　　　　　",null,null,null,"第1希望",null,"第2希望",null,"第3希望",null,"備考欄【当院への連絡事項】\n","決定受診日","曜日","時間","当院から連絡事項"]
[null,null,"桜十字福岡病院\n桜十字博多駅健診クリニック\n","相違があるとご受診いただけない場合があります\n      ご提出の際は今一度お間違いないかご確認ください。",null,null,null,"昭和：S\n平成：H\n西暦可\n（200/1/1）",null,"各健保指定の健診コースをご記入ください",null,"その他検査項目で追加ご希望の場合はこちら\n","女性限定",null,null,null,null,null,null,null,null,"例）転籍により保険証番号変更あり、苗字変更あり、FCF会員の場合は会員番号"]
[null,null,null,null,null,null,null,null,null,null,null,null,"マンモグラフィー","乳腺超音波","子宮細胞診"]
[null,null,"桜十字福岡病院",1,"桜十字　太郎","サクラジュウジ　タロウ","男","1974-01-01",{"$f":"IF(OR(H13=\"\", $I$8=\"\"), \"\", DATEDIF(H13,$I$8,\"y\"))","v":53},"一般健診","胃カメラ（鼻、口/鎮静なし）","内臓脂肪CT,ヘリコバクターピロリIgG",null,null,null,"4月","1日","5月","1日","6月","1日",null,"2026-04-01",{"$f":"TEXT(W13,\"(aaa)\")","v":"(水)"},"／"]
[null,null,"桜十字博多駅健診CL",12,"桜十字　花子","サクラジュウジ　ハナコ","女","1977-01-01",{"$f":"IF(OR(H14=\"\", $I$8=\"\"), \"\", DATEDIF(H14,$I$8,\"y\"))","v":50},"脳ドック",null,"骨密度検査","MG２方向","乳エコー","子宮細胞診","5月","1日","6月","1日","7月","1日",null,"2026-04-01",{"$f":"TEXT(W14,\"(aaa)\")","v":"(水)"},"／",null,null,null,null,null,null,null,"システムで使ってます\n消さないでください\n※最大3000人","システムで使ってます\n消さないでください\n※最大3000人"]
[1,{"$f":"IFERROR(VLOOKUP(AH15,'ID(当院入力シート)'!E:F,2,FALSE)&\"\",\"\")","v":""},null,null,null,null,null,null,{"$f":"IF(OR(H15=\"\", $I$8=\"\"), \"\", DATEDIF(H15,$I$8,\"y\"))","v":""},null,null,null,null,null,null,"　",null,"　",null,"　",null,null,null,{"$f":"IF(W15=\"\",\"\", \"(\" & TEXT(W15,\"aaa\") & \")\")","v":""},null,null,null,null,null,null,null,null,{"$f":"SUBSTITUTE(SUBSTITUTE(E15,\"　\",\"\"),\" \",\"\")","v":""},{"$f":"AG15&H15","v":""}]
[2,{"$f":"IFERROR(VLOOKUP(AH16,'ID(当院入力シート)'!E:F,2,FALSE)&\"\",\"\")","v":""},null,null,null,null,null,null,{"$f":"IF(OR(H16=\"\", $I$8=\"\"), \"\", DATEDIF(H16,$I$8,\"y\"))","v":""},null,null,null,null,null,null,"　",null,"　",null,"　",null,null,null,{"$f":"IF(W16=\"\",\"\", \"(\" & TEXT(W16,\"aaa\") & \")\")","v":""},null,null,null,null,null,null,null,null,{"$f":"SUBSTITUTE(SUBSTITUTE(E16,\"　\",\"\"),\" \",\"\")","v":""},{"$f":"AG16&H16","v":""}]
[3,{"$f":"IFERROR(VLOOKUP(AH17,'ID(当院入力シート)'!E:F,2,FALSE)&\"\",\"\")","v":""},null,null,null,null,null,null,"",null,null,null,null,null,null,"　",null,"　",null,"　",null,null,null,{"$f":"IF(W17=\"\",\"\", \"(\" & TEXT(W17,\"aaa\") & \")\")","v":""},null,null,null,null,null,null,null,null,"",""]
[4,{"$f":"IFERROR(VLOOKUP(AH18,'ID(当院入力シート)'!E:F,2,FALSE)&\"\",\"\")","v":""},null,null,null,null,null,null,"",null,null,null,null,null,null,"　",null,"　",null,"　",null,null,null,"",null,null,null,null,null,null,null,null,"",""]
[5,{"$f":"IFERROR(VLOOKUP(AH19,'ID(当院入力シート)'!E:F,2,FALSE)&\"\",\"\")","v":""},null,null,null,null,null,null,{"$f":"IF(OR(H19=\"\", $I$8=\"\"), \"\", DATEDIF(H19,$I$8,\"y\"))","v":""},null,null,null,null,null,null,"　",null,"　",null,"　",null,null,null,"",null,null,null,null,null,null,null,null,"",""]
[6,{"$f":"IFERROR(VLOOKUP(AH20,'ID(当院入力シート)'!E:F,2,FALSE)&\"\",\"\")","v":""},null,null,null,null,null,null,"",null,null,null,null,null,null,"　",null,"　",null,"　",null,null,null,"",null,null,null,null,null,null,null,null,"",""]
{"$rows_left_out":981}
{"sheet":"ID(当院入力シート)","index":5,"n_rows":3001,"n_cols":6,"rows_kept":3001,"cut":false,"hidden":false,"merged":[]}
["氏名","カナ氏名","[団体個人]カナ氏名","生年月日","自動生成(消さないで)\n※最大3000人","ワイズマンID"]
[null,null,null,null,{"$f":"SUBSTITUTE(SUBSTITUTE(A2,\"　\",\"\"),\" \",\"\")&D2","v":""}]
[null,null,null,null,{"$f":"SUBSTITUTE(SUBSTITUTE(A3,\"　\",\"\"),\" \",\"\")&D3","v":""}]
[null,null,null,null,{"$f":"SUBSTITUTE(SUBSTITUTE(A4,\"　\",\"\"),\" \",\"\")&D4","v":""}]
[null,null,null,null,""]
[null,null,null,null,""]
[null,null,null,null,""]
[null,null,null,null,""]
[null,null,null,null,""]
[null,null,null,null,""]
[null,null,null,null,""]
[null,null,null,null,""]
[null,null,null,null,""]
[null,null,null,null,""]
[null,null,null,null,""]
[null,null,null,null,""]
[null,null,null,null,""]
[null,null,null,null,""]
[null,null,null,null,""]
[null,null,null,null,""]
{"$rows_left_out":2982}
{"sheet":"⑤申込みスケジュール","index":6,"n_rows":25,"n_cols":16,"rows_kept":25,"cut":false,"hidden":false,"merged":[[14,2,15,2],[14,7,14,9],[14,11,15,15],[15,8,15,10],[22,14,22,15],[16,8,16,15],[18,10,18,15],[19,11,19,15],[20,12,20,15],[21,13,21,15],[11,6,11,8],[12,2,13,2],[12,6,12,8],[12,10,13,15],[13,7,13,9],[2,1,2,15],[4,1,5,3],[4,4,4,15],[6,1,24,1],[6,2,7,2],[6,4,6,6],[6,7,7,15],[7,4,7,6],[8,2,9,2],[8,4,8,6],[8,8,9,15],[17,9,17,15],[9,5,9,7],[10,2,11,2],[10,5,10,7],[10,9,11,15]]}
[]
[]
[null,"申込みスケジュール"]
[]
[null,"2026年度",null,null,"受 診 希 望 月"]
[null,null,null,null,"4月健診","5月健診","6月健診","7月健診","8月健診","9月健診","10月健診","11月健診","12月健診","1月健診","2月健診","3月健診"]
[null,"申込み時期","2月","15日までに申込み","2月末日までに回答",null,null,"3月末日までに回答　　　　　　　　　　　　　　　　　　　　"]
[null,null,null,"末日までに申込み","3月15日までに回答"]
[null,null,"3月","15日までに申込み","3月末日までに回答",null,null,null,"4月末日までに回答　　　　　　　　　　　　　　　　　　　　"]
[null,null,null,"末日までに申込み",null,"4月15日までに回答"]
[null,null,"4月","15日までに申込み",null,"4月末日までに回答",null,null,null,"5月末日までに回答　　　　　　　　　　　　　　　　　　　　"]
[null,null,null,"末日までに申込み",null,null,"5月15日までに回答"]
[null,null,"5月","15日までに申込み",null,null,"5月末日までに回答",null,null,null,"6月末日までに回答　　　　　　　　　　　　　　　　　　　　"]
[null,null,null,"末日までに申込み",null,null,null,"6月15日までに回答"]
[null,null,"6月","15日までに申込み",null,null,null,"6月末日までに回答",null,null,null,"7月末日までに回答　　　　　　　　　　　　　　　　　　　　"]
[null,null,null,"末日までに申込み",null,null,null,null,"7月15日までに回答"]
[null,null,"7月","末日までに申込み",null,null,null,null,"2週間以内に回答"]
[null,null,"8月","末日までに申込み",null,null,null,null,null,"2週間以内に回答"]
[null,null,"9月","末日までに申込み",null,null,null,null,null,null,"2週間以内に回答"]
[null,null,"10月","末日までに申込み",null,null,null,null,null,null,null,"2週間以内に回答"]
{"$rows_left_out":6}
{"sheet":"⑥営業時間","index":7,"n_rows":65,"n_cols":14,"rows_kept":65,"cut":false,"hidden":false,"merged":[[63,1,63,13],[64,1,64,13],[44,3,44,7],[44,8,44,13],[44,1,45,2],[34,1,34,13],[61,1,61,13],[29,11,29,13],[29,8,29,9],[56,8,56,9],[41,3,41,13],[42,3,42,13],[43,3,43,13],[56,3,56,5],[57,3,57,13],[46,6,46,7],[48,6,48,7],[56,6,56,7],[54,6,54,7],[52,6,52,7],[50,6,50,7],[47,6,47,7],[49,6,49,7],[30,3,30,13],[17,8,17,13],[17,3,17,7],[17,1,18,2],[19,8,19,13],[21,8,21,13],[25,8,25,13],[23,8,23,13],[20,8,20,13],[24,8,24,13],[19,6,19,7],[20,6,20,7],[29,6,29,7],[27,6,27,7],[25,6,25,7],[23,6,23,7],[21,6,21,7],[22,3,22,13],[28,3,28,13],[26,6,26,7],[24,6,24,7],[26,3,26,5],[27,3,27,5],[27,8,27,13],[50,8,50,9],[51,3,51,5],[52,3,52,5],[53,3,53,5],[54,3,54,5],[55,3,55,5],[46,3,46,5],[47,3,47,5],[48,3,48,5],[49,3,49,5],[50,3,50,5],[1,1,1,13],[41,1,41,2],[33,1,33,13],[32,1,32,13],[19,1,20,1],[21,1,22,1],[23,1,24,1],[25,1,26,1],[27,1,28,1],[29,1,30,1],[15,1,15,2],[14,1,14,2],[3,1,3,13],[14,3,14,13],[15,3,15,13],[16,3,16,13],[19,3,19,5],[20,3,20,5],[21,3,21,5],[23,3,23,5],[24,3,24,5],[25,3,25,5],[26,8,26,13],[29,3,29,5],[62,1,62,13],[4,1,4,13],[5,1,5,13],[59,1,59,13],[60,1,60,13],[54,1,55,1],[56,1,57,1],[35,1,35,13],[43,1,43,2],[16,1,16,2],[46,12,56,13],[52,8,52,9],[54,8,54,9],[42,1,42,2],[11,1,11,13],[46,1,47,1],[48,1,49,1],[50,1,51,1],[52,1,53,1],[51,6,51,7],[53,6,53,7],[55,6,55,7],[46,8,46,9],[48,8,48,9]]}
[]
[]
[]
[null,"2026年度"]
[null,"桜十字福岡病院・桜十字博多駅健診クリニック"]
[null,"　人間ドック/健康診断　営業時間ご案内"]
[]
[]
[]
[]
[]
[null,"適用期間 ( 2026年4月1日 ～ 2027年3月31日 )　　　　※予定はご案内無しに変更となる場合がございます。予めご了承ください。"]
[]
[]
[null,"施設名称",null,"　桜十字福岡病院 2F　　人間ドック・健診センター"]
[null,"所在地",null,"　福岡市中央区渡辺通3-5-11"]
[null,"営業時間",null,"　【AM】 7：45 ～ 10：30 (※土曜日： 8：00 ～ 9：45)　　　　　【PM】 13：45 ～ 15：00"]
[null,null,null,"健診コース",null,null,null,null,"検査項目"]
[null,null,null,"定期健診","雇用時健診","法定健診\n(胃の検査なし)","生活習慣病\n健診","人間\nドック","超音波検査\n(エコー) ※1","胃部検査\n※2","大腸検査\n※3","婦人科検診\n※4","MRI","CT"]
[null,"月","AM",null,null,null,"○",null,"○"]
{"$rows_left_out":46}
{"sheet":"⑦診療日カレンダー","index":8,"n_rows":138,"n_cols":24,"rows_kept":138,"cut":false,"hidden":false,"merged":[[110,1,110,7],[110,9,110,15],[110,17,110,23],[124,1,124,7],[124,9,124,15],[124,17,124,23],[94,1,94,7],[94,9,94,15],[94,17,94,23],[38,1,38,7],[38,9,38,15],[38,17,38,23],[52,1,52,7],[52,9,52,15],[52,17,52,23],[74,1,74,23],[76,1,76,23],[78,1,78,7],[78,9,78,15],[78,17,78,23],[22,1,22,7],[22,9,22,15],[22,17,22,23],[2,1,2,23],[4,1,4,23],[6,1,6,7],[6,9,6,15],[6,17,6,23]]}
[]
[]
[null,"健診カレンダー（桜十字福岡病院）"]
[]
[null,"　　　　火曜日・金曜日・土曜日は午前のみ（午後休館）"]
[]
[null,2026,null,null,null,null,null,null,null,2026,null,null,null,null,null,null,null,2026]
[null,"日","月","火","水","木","金","土",null,"日","月","火","水","木","金","土",null,"日","月","火","水","木","金","土"]
[null,null,null,null,1,2,3,4,null,null,null,null,null,null,1,2,null,null,1,2,3,4,5,6]
[null,null,null,null,null,null,null,"休館",null,null,null,null,null,null,null,"休館"]
[null,5,6,7,8,9,10,11,null,3,4,5,6,7,8,9,null,7,8,9,10,11,12,13]
[null,"休館",null,null,null,null,null,"休館",null,"休館","休館","休館","休館",null,null,"休館",null,"休館",null,null,null,null,null,"休館"]
[null,12,13,14,15,16,17,18,null,10,11,12,13,14,15,16,null,14,15,16,17,18,19,20]
[null,"休館",null,null,null,null,null,null,null,"休館",null,null,null,null,null,null,null,"休館"]
[null,19,20,21,22,23,24,25,null,17,18,19,20,21,22,23,null,21,22,23,24,25,26,27]
[null,"休館",null,null,null,null,null,"休館",null,"休館",null,null,null,null,null,"休館",null,"休館",null,null,null,null,null,"休館"]
[null,26,27,28,29,30,null,null,null,24,25,26,27,28,29,30,null,28,29,30]
[null,"休館",null,null,"休館",null,null,null,null,"休館",null,null,null,null,null,null,null,"休館"]
[null,null,null,null,null,null,null,null,null,31]
[null,null,null,null,null,null,null,null,null,"休館"]
{"$rows_left_out":119}
{"sheet":"⓼オプション","index":9,"n_rows":71,"n_cols":5,"rows_kept":71,"cut":false,"hidden":false,"merged":[[26,0,35,0],[1,0,1,1],[2,0,11,0],[12,0,15,0],[16,0,21,0],[22,0,25,0],[69,1,69,3],[36,0,39,0],[40,0,41,0],[44,0,46,0],[44,2,45,2],[47,0,57,0],[58,0,68,0]]}
["2026年度 オプション検査料金表",null,null,null,"料金　税込【10％】"]
["オプション名",null,"検査の説明","桜十字福岡病院","博多駅健診クリニック"]
["脳・心臓","頭部MRI・MRA　※1","磁石と電磁波を用い放射線被曝なく脳の状態を詳しく調べることができるため、将来の脳卒中予防の目的で脳ドックの主要検査項目の一つとなっています。また造影剤（薬剤）を用いずに脳の動脈を立体的に観察できるため、くも膜下出血の原因となる未破裂動脈瘤の有無についても調べることが可能です。",27500]
[null,"頸動脈超音波（エコー）","頸動脈にエコーをあて動脈壁の厚さを測定し、全身の動脈硬化の程度を判定する検査です。また頸動脈が狭くなっていないかについても調べることができます。",4730,4400]
[null,"脳検査セット　※1\n　（頭部MRI・MRA + 頸動脈超音波）","MRIによる脳や脳動脈の状態チェックとエコーによる動脈硬化のチェックを合わせたセットです。40歳以上、飲酒や喫煙量が多い、血縁者に脳卒中になった方がいる、肥満や生活習慣病がある方などにおすすめです。",29150]
[null,"AI認知機能検査（BrainSuite）","AIを使用した認知機能検査です。脳画像検査（MRI）及び認知機能スクリーニング検査を行い、現在の脳機能を評価することで、生活習慣を見直し、脳萎縮を抑え認知症等の疾患を予防・脳健康を維持することにつなげます。\n※MRIの検査と併せて実施する為、すでにMRIを申し込まれている方が追加可能です。",11220]
[null,"AI認知機能検査セット　※1\n　（頭部MRI・MRA + BrainSuite）","MRIによる脳や脳動脈の状態チェックとAIを使用した認知機能検査を合わせたセットです。",35200]
[null,"MCIスクリーニング検査プラス","軽度認知障害 (MCI ）のリスク を調べることができる40歳以上の方にお勧めの血液検査です。\n認知症の予備軍とも言われ、そのまま放置すると5年で50%近くが認知症に進行しすると言われております。なお、急性炎症が認められる方、肝硬変の方、先天的脂質異常症の方、自己免疫性疾患をお持ちの方は判定結果に影響する可能性がございます。",24200,24200]
[null,"安静時心電図","手足・胸に電極を付け、心臓が発する電気刺激を波形として記録する検査です。心臓の病気を発見する手掛かりになります。",1980,1650]
[null,"Heartnote®　ホルター心電図検査","小型・軽量のため日常生活での負担が少なく、最長7日間の心電図を検査できます。発作性心房細動など、通常の健診の短い心電図では発見しにくい不整脈の検出率を高め、脳梗塞リスクの早期発見に貢献します。\n(医師コメント付)",23100,23100]
[null,"NTPro-BNP","心臓にかかる負荷の有無やその程度を測定する心機能のマーカーです。自覚症状のない初期の段階の心機能低下の早期発見につながります。",2750,2750]
[null,"LOX‐index　※1","脳梗塞や心筋梗塞の原因となる動脈硬化の原因物質を測定することにより、脳梗塞や心筋梗塞の発症リスクがわかる最新の検査です。近親者でこれらの疾患の既往歴がある方、コレステロールや血糖値が高い方、喫煙されている40歳以上の方などにおすすめです。妊娠中の方は正確な数値が出ませんのでご注意ください。",13200,13200]
["肺","低線量肺がんCT　※1","日本人のがん死亡者数の第１位である肺がんを発見することに特化したCT検査です。対象臓器を肺に限定することで、被ばく線量を従来の胸部CTの約1/5（当院従来比）に低減させることができます。",11000]
[null,"喀痰検査","痰の中に病的な細胞が含まれていないかを顕微鏡で調べる検査です。主に扁平上皮がんの発見を目的として胸部レントゲン写真や低線量肺がんCTと併せて行います。",3300,3300]
[null,"Pro‐GRP","肺がん（特に小細胞がん）に有用な腫瘍マーカーです。",2750,2750]
[null,"シフラ","肺がん（特に扁平上皮がん）に有用な腫瘍マーカーです。",2750,2750]
["胃","胃透視（バリウム検査）　※1","バリウムを飲んでX線で食道・胃・十二指腸の上部消化管の検査を行います。胃全体の形を捉えやすいため、スキルス胃がんの特徴である胃の伸展不良（壁が硬くふくらみが悪い）の診断に有用です。",12100,11000]
[null,"35歳未満限定胃透視（バリウム検査）　※1","35歳未満限定料金。一般的な胃がんはピロリ菌の感染や喫煙などがリスクとされ50代以上の男性に多いのに対して、スキルス胃がんは20代や30代の若年層（特に女性）にも発生することがあります。",7700,7700]
[null,"胃内視鏡検査（胃カメラ）　※1 　　　　　　　","内視鏡を使用して、食道・胃・十二指腸を直接観察し、がん、潰瘍・ポリープ・炎症などの発見に有用です。カメラを口から挿入する方法と鼻から挿入する方法があります。",17600,16500]
[null,"胃内視鏡検査（胃カメラ）鎮静剤　　　　　　　","胃カメラ時（口から挿入する場合）に使用します。意識がぼんやりとした状態となり苦痛を軽減できますが、使用後は一定時間お休み頂きます。検査当日は車等の運転は出来ません。\n※鎮静効果には個人差があります。",3300,3300]
{"$rows_left_out":52}
{"sheet":"⑧オプション一覧","index":10,"n_rows":69,"n_cols":6,"rows_kept":69,"cut":false,"hidden":true,"merged":[[68,2,68,5],[67,4,67,5],[66,4,66,5],[65,4,65,5],[57,1,67,1],[64,4,64,5],[63,4,63,5],[62,4,62,5],[60,4,60,5],[59,4,59,5],[58,4,58,5],[57,4,57,5],[61,4,61,5],[48,4,48,5],[50,4,50,5],[53,4,53,5],[52,4,52,5],[51,4,51,5],[46,4,46,5],[32,4,32,5],[30,4,30,5],[29,4,29,5],[28,4,28,5],[35,4,35,5],[34,4,34,5],[33,4,33,5],[36,4,36,5],[41,4,41,5],[40,4,40,5],[43,4,43,5],[42,4,42,5],[31,4,31,5],[21,4,21,5],[20,4,20,5],[19,4,19,5],[17,4,17,5],[23,4,23,5],[47,1,56,1],[1,1,1,5],[9,4,9,5],[11,4,11,5],[12,4,12,5],[15,4,15,5],[14,4,14,5],[4,1,12,1],[13,1,15,1],[25,4,25,5],[24,4,24,5],[2,4,2,5],[2,1,3,2],[2,3,3,3],[16,1,21,1],[22,1,25,1],[26,1,35,1],[36,1,39,1],[40,1,41,1],[44,1,46,1],[44,3,45,3]]}
[]
[null,"2025年度 　　オプション検査料金表"]
[null,"オプション名",null,"検査の説明","料金（税込）"]
[null,null,null,null,"天神","博多"]
[null,"脳・心臓","頭部MRI・MRA　※1","磁石と電磁波を用い放射線被曝なく脳の状態を詳しく調べることができるため、将来の脳卒中予防の目的で脳ドックの主要検査項目の一つとなっています。また造影剤（薬剤）を用いずに脳の動脈を立体的に観察できるため、くも膜下出血の原因となる未破裂動脈瘤の有無についても調べることが可能です。",27500]
[null,null,"頸動脈エコー","頸動脈にエコーをあて動脈壁の厚さを測定し、全身の動脈硬化の程度を判定する検査です。また頸動脈が狭くなっていないかについても調べることができます。",4730,4400]
[null,null,"脳検査セット　※1\n　（頭部MRI・MRA + 頸動脈エコー）","MRIによる脳や脳動脈の状態チェックとエコーによる動脈硬化のチェックを合わせたセットです。40歳以上、飲酒や喫煙量が多い、血縁者に脳卒中になった方がいる、肥満や生活習慣病がある方などにおすすめです。",29150]
[null,null,"AI認知機能検査（BrainSuite）","AIを使用した認知機能検査です。脳画像検査（MRI）及び認知機能スクリーニング検査を行い、現在の脳機能を評価することで、生活習慣を見直し、脳萎縮を抑え認知症等の疾患を予防・脳健康を維持することにつなげます。\n※MRIの検査と併せて実施する為、すでにMRIを申し込まれている方が追加可能です。",11220]
[null,null,"AI認知機能検査セット　※1\n　（頭部MRI・MRA + BrainSuite）","MRIによる脳や脳動脈の状態チェックとAIを使用した認知機能検査を合わせたセットです。",35200]
[null,null,"MCIスクリーニング検査プラス","軽度認知障害 (MCI ）のリスク を調べることができる40歳以上の方にお勧めの血液検査です。\n認知症の予備軍とも言われ、そのまま放置すると5年で50%近くが認知症に進行しすると言われております。また急性炎症が認められる方、肝硬変の方、先天的脂質異常症の方、自己免疫性疾患をお持ちの方は判定結果に影響する可能性がございます。",24200]
[null,null,"安静時心電図","手足・胸に電極を付け、心臓が発する電気刺激を波形として記録する検査です。心臓の病気を発見する手掛かりになります。",1980,1650]
[null,null,"NTPro-BNP","心臓にかかる負荷の有無やその程度を測定する心機能のマーカーです。自覚症状のない初期の段階の心機能低下の早期発見につながります。",2750]
[null,null,"LOX‐index　※1","脳梗塞や心筋梗塞の原因となる動脈硬化の原因物質を測定することにより、脳梗塞や心筋梗塞の発症リスクがわかる最新の検査です。近親者でこれらの疾患の既往歴がある方、コレステロールや血糖値が高い方、喫煙されている40歳以上の方などにおすすめです。妊娠中の方は正確な数値が出ませんのでご注意ください。",13200]
[null,"肺","低線量肺がんCT　※1","日本人のがん死亡者数の第１位である肺がんを発見することに特化したCT検査です。対象臓器を肺に限定することで、被ばく線量を従来の胸部CTの約1/5（当院従来比）に低減させることができます。",11000]
[null,null,"Pro‐GRP","肺がん（特に小細胞がん）に有用な腫瘍マーカーです。",2750]
[null,null,"シフラ","肺がん（特に扁平上皮がん）に有用な腫瘍マーカーです。",2750]
[null,"胃","胃透視（バリウム検査）　※1","バリウムを飲んでX線で食道・胃・十二指腸の上部消化管の検査を行います。胃全体の形を捉えやすいため、スキルス胃がんの特徴である胃の伸展不良（壁が硬くふくらみが悪い）の診断に有用です。",12100,11000]
[null,null,"35歳未満限定胃透視（バリウム検査）　※1","35歳未満限定料金。一般的な胃がんはピロリ菌の感染や喫煙などがリスクとされ50代以上の男性に多いのに対して、スキルス胃がんは20代や30代の若年層（特に女性）にも発生することがあります。",7700]
[null,null,"胃カメラ（胃内視鏡検査）　※1","内視鏡を使用して、食道・胃・十二指腸を直接観察し、がん、潰瘍・ポリープ・炎症などの発見に有用です。カメラを口から挿入する方法と鼻から挿入する方法があります。",17600,16500]
[null,null,"胃カメラ鎮静剤","胃カメラ時（口から挿入する場合）に使用します。意識がぼんやりとした状態となり苦痛を軽減できますが、使用後は一定時間お休み頂きます。検査当日は車等の運転は出来ません。※鎮静効果には個人差があります。",3300]
{"$rows_left_out":50}
{"sheet":"取り込み用","index":11,"n_rows":1,"n_cols":33,"rows_kept":1,"cut":false,"hidden":true,"merged":[]}
["受診施設","受付フロア","予約日","予約時間帯コード","呼出時間","団体番号","個人番号","カナ氏名","漢字氏名","性別","生年月日","保険者番号","被保険者証等記号","被保険者証等番号","契約番号","主コース","胃カメラ","協会マンモ","協会子宮","オプション","オプション","本人・家族区分","従業員コード","部署コード１","部署コード２","部署コード３","郵便番号","住所１","住所２","予約コメント","E-MAIL","加入健保団体番号","予約区分"]

{"sheet":"契約コース内容","index":12,"n_rows":27,"n_cols":2,"rows_kept":27,"cut":false,"hidden":true,"merged":[]}
["F0001","◆天神◆定期健康診断Ｂ"]
["F0002","◇博多◇定期健康診断Ｂ"]
["F0003","◆天神◆定期健康診断Ａ"]
["F0101","◇博多◇定期健康診断Ａ"]
["FK001","協会けんぽ一般健診"]
["FK002","協会けんぽ付加健診"]
["FK003","◆天神◆協会けんぽ付加健診同項目"]
["FK004","◆天神◆協会けんぽ一般健診同項目"]
["FK005","◆天神◆協会けんぽ差額人間ドック"]
["FK008","◇博多◇協会けんぽ付加健診同項目"]
["FK009","◇博多◇協会けんぽ一般健診同項目"]
["FK010","◇博多◇協会けんぽ差額人間ドック"]
["FK099","協会けんぽ肝炎ウィルス検査"]
["FK100","協会けんぽ子宮頸がん検診"]
["FK101","協会けんぽ乳がん検診(2方向)"]
["FK102","協会けんぽ乳がん検診(1方向)"]
["FZ001","◆天神◆マンモグラフィ(1方向)"]
["FZ002","◆天神◆マンモグラフィ(2方向)"]
["FZ003","◆天神◆乳腺超音波"]
["FZ004","◆天神◆子宮頸部細胞診"]
{"$rows_left_out":8}
{"sheet":"運用について","index":13,"n_rows":10,"n_cols":5,"rows_kept":10,"cut":false,"hidden":true,"merged":[[5,1,9,1],[5,2,9,2],[5,0,9,0]]}
[null,"業務内容","流れ","詳細","システム"]
["①","既存ID抽出","当院→企業","個人一覧より企業登録の既存の情報を抽出しエクセルデーターを作成","★企業やり取りエクセルデータ"]
[]
["②","今年度の受診対象者リスト作成","企業→当院","①のエクセルデータに今年度の対象者・検査コース・OPなど希望内容を担当者で整え提供してもらう","★企業やり取りエクセルデータ"]
[]
["③","予約枠・契約・日程を調整する","当院","新規ID作成（ワイズマン作成自動化あり）","★ID自動化CSV作成"]
[null,null,null,"団体契約運用を作成　（協会けんぽ親団体で運用）"]
[null,null,null,"日程を仮枠で提供　もしくは　日程を確定し提供","★一括オーダ取り込みCSV作成"]
[null,null,null,"仮枠を提供","★仮枠提供一覧作成"]
[null,null,null,"日程を確定","★日程表一覧作成"]

{"sheet":"検査項目セレクト","index":14,"n_rows":3,"n_cols":10,"rows_kept":3,"cut":false,"hidden":true,"merged":[]}
["定期Ｂ","定期Ｂ","一般健診","一般健診","バリウム","〇","MG１方向",null,"乳エコー","子宮細胞診"]
[null,"一般健診（若年）","人間ドック","節目健診","胃カメラ(鼻・口/鎮静なし)","✕","MG２方向"]
[null,null,null,"人間ドック","胃カメラ(口/鎮静あり)"]